Target
Alpha-glucosidase MAL12
Ligand
BDBM243075
Substrate
Meas. Tech.
Inhibition Assay
pH
7±n/a
IC50
9.6e+3±n/a nM
Comments
extracted
Citation
 Yousefi, RAlavian-Mehr, MMMokhtari, FPanahi, FMehraban, MHKhalafi-Nezhad, A Pyrimidine-fused heterocycle derivatives as a novel class of inhibitors for a-glucosidase. J Enzyme Inhib Med Chem 28:1228-35 (2013)  
Target
Name:
Alpha-glucosidase MAL12
Synonyms:
α-Glucosidase MAL12_YEAST Maltase | alpha-Glucosidase (α-Glucosidase)
Type:
Protein
Mol. Mass.:
68084.32
Organism:
Saccharomyces cerevisiae
Description:
P53341
Residue:
584
  
Inhibitor
Name:
BDBM243075
Synonyms:
α-Gl inhibitor, C3
Type:
Small organic molecule
Emp. Form.:
C26H26N6O11S
Mol. Mass.:
630.583
SMILES:
Nc1ccc(cc1)S(=O)(=O)c1ccc(cc1)N1c2[nH]c(=O)[nH]c(=O)c2C(C(O)C(O)C(O)C(O)CO)c2c1[nH]c(=O)[nH]c2=O
: