Target
Fatty acid synthase
Ligand
BDBM244423
Substrate
Meas. Tech.
Biochemical Assay
Temperature
277.15±n/a K
IC50
12±n/a nM
Comments
extracted
Citation
 Oslob, JDMcDowell, RSJohnson, RYang, HEvanchik, MZaharia, CACai, HHu, LWWagman, AS Heterocyclic modulators of lipid synthesis US Patent  US9428502 Publication Date 8/30/2016 
Target
Name:
Fatty acid synthase
Synonyms:
FAS FAS_HUMAN HU FASN
Type:
Enzyme
Mol. Mass.:
273419.37
Organism:
Homo sapiens (Human)
Description:
P49327
Residue:
2511
  
Inhibitor
Name:
BDBM244423
Synonyms:
US10226449, cpd 32 | US9428502, 32
Type:
Small organic molecule
Emp. Form.:
C25H25ClN4O
Mol. Mass.:
432.945
SMILES:
Cc1nc(Cl)c([nH]1)-c1cc(C(=O)N2CCC(CC2)c2ccc(cc2)C#N)c(C)cc1C
: