Target
Fatty acid synthase
Ligand
BDBM244440
Substrate
Meas. Tech.
Biochemical Assay
Temperature
277.15±n/a K
IC50
9±n/a nM
Comments
extracted
Citation
 Oslob, JDMcDowell, RSJohnson, RYang, HEvanchik, MZaharia, CACai, HHu, LWWagman, AS Heterocyclic modulators of lipid synthesis US Patent  US9428502 Publication Date 8/30/2016 
Target
Name:
Fatty acid synthase
Synonyms:
FAS FAS_HUMAN HU FASN
Type:
Enzyme
Mol. Mass.:
273419.37
Organism:
Homo sapiens (Human)
Description:
P49327
Residue:
2511
  
Inhibitor
Name:
BDBM244440
Synonyms:
US10226449, cpd 49 | US9428502, 49
Type:
Small organic molecule
Emp. Form.:
C26H27ClN4O
Mol. Mass.:
446.972
SMILES:
CC(C)c1nc(Cl)c([nH]1)-c1cc(ccc1C)C(=O)N1CCC(CC1)c1ccc(cc1)C#N
: