Target
Fatty acid synthase
Ligand
BDBM244563
Substrate
Meas. Tech.
Biochemical Assay
Temperature
277.15±n/a K
IC50
11±n/a nM
Comments
extracted
Citation
 Oslob, JDMcDowell, RSJohnson, RYang, HEvanchik, MZaharia, CACai, HHu, LWWagman, AS Heterocyclic modulators of lipid synthesis US Patent  US9428502 Publication Date 8/30/2016 
Target
Name:
Fatty acid synthase
Synonyms:
FAS FAS_HUMAN HU FASN
Type:
Enzyme
Mol. Mass.:
273419.37
Organism:
Homo sapiens (Human)
Description:
P49327
Residue:
2511
  
Inhibitor
Name:
BDBM244563
Synonyms:
US10226449, cpd 172 | US9428502, 172
Type:
Small organic molecule
Emp. Form.:
C26H26N4O2
Mol. Mass.:
426.5102
SMILES:
Cc1nc([nH]c1-c1cc(ccc1C)C(=O)N1CC(C1)c1ccc(cc1)C#N)C1CCOC1
: