Target
Fatty acid synthase
Ligand
BDBM244587
Substrate
Meas. Tech.
Biochemical Assay
Temperature
277.15±n/a K
IC50
15±n/a nM
Comments
extracted
Citation
 Oslob, JDMcDowell, RSJohnson, RYang, HEvanchik, MZaharia, CACai, HHu, LWWagman, AS Heterocyclic modulators of lipid synthesis US Patent  US9428502 Publication Date 8/30/2016 
Target
Name:
Fatty acid synthase
Synonyms:
FAS FAS_HUMAN HU FASN
Type:
Enzyme
Mol. Mass.:
273419.37
Organism:
Homo sapiens (Human)
Description:
P49327
Residue:
2511
  
Inhibitor
Name:
BDBM244587
Synonyms:
US9428502, 196
Type:
Small organic molecule
Emp. Form.:
C28H30N4O3
Mol. Mass.:
470.5628
SMILES:
COC1(CCCOC1)c1nc(C)c([nH]1)-c1cc(ccc1C)C(=O)N1CC(C1)c1ccc(cc1)C#N
: