Target
Fatty acid synthase
Ligand
BDBM244612
Substrate
Meas. Tech.
Biochemical Assay
Temperature
277.15±n/a K
IC50
43±n/a nM
Comments
extracted
Citation
 Oslob, JDMcDowell, RSJohnson, RYang, HEvanchik, MZaharia, CACai, HHu, LWWagman, AS Heterocyclic modulators of lipid synthesis US Patent  US9428502 Publication Date 8/30/2016 
Target
Name:
Fatty acid synthase
Synonyms:
FAS FAS_HUMAN HU FASN
Type:
Enzyme
Mol. Mass.:
273419.37
Organism:
Homo sapiens (Human)
Description:
P49327
Residue:
2511
  
Inhibitor
Name:
BDBM244612
Synonyms:
US10226449, cpd 221 | US9428502, 221
Type:
Small organic molecule
Emp. Form.:
C23H19N5O2
Mol. Mass.:
397.4293
SMILES:
Cc1ccc(cc1-c1[nH]c(CO)nc1C#N)C(=O)N1CC(C1)c1ccc(cc1)C#N
: