Target
Serine-protein kinase ATM
Ligand
BDBM245535
Substrate
Meas. Tech.
Cellular Assay
Temperature
310.15±n/a K
IC50
0.741±n/a nM
Comments
extracted
Citation
 Barlaam, BCPike, KG Imidazo[4,5-c]quinolin-2-one compounds and their use in treating Cancer US Patent  US9428503 Publication Date 8/30/2016 
Target
Name:
Serine-protein kinase ATM
Synonyms:
A-T mutated ATM_HUMAN | Ataxia telangiectasia mutated
Type:
Protein
Mol. Mass.:
350696.72
Organism:
Homo sapiens (Human)
Description:
Q13315
Residue:
3056
  
Inhibitor
Name:
BDBM245535
Synonyms:
US9428503, 64
Type:
Small organic molecule
Emp. Form.:
C30H38N6O2
Mol. Mass.:
514.6617
SMILES:
CO[C@@H]1CC[C@H](C1)n1c2c(cnc3ccc(cc23)-c2ccc(NCCCN3CCCCC3)nc2)n(C)c1=O
: