Target
Serine/threonine-protein kinase ATR
Ligand
BDBM245491
Substrate
Meas. Tech.
Cellular Assay
Temperature
310.15±n/a K
IC50
>30000±n/a nM
Comments
extracted
Citation
 Barlaam, BCPike, KG Imidazo[4,5-c]quinolin-2-one compounds and their use in treating Cancer US Patent  US9428503 Publication Date 8/30/2016 
Target
Name:
Serine/threonine-protein kinase ATR
Synonyms:
ATR Ataxia telangiectasia and Rad3-related protein (ATR) FRP1 | Serine-protein kinase ATR
Type:
Protein
Mol. Mass.:
301404.58
Organism:
Homo sapiens (Human)
Description:
Q13535
Residue:
2644
  
Inhibitor
Name:
BDBM245491
Synonyms:
US9428503, 18
Type:
Small organic molecule
Emp. Form.:
C26H30FN5O3
Mol. Mass.:
479.5465
SMILES:
CO[C@H]1C[C@H](C1)n1c2c(cnc3ccc(cc23)-c2ccc(OCCCN(C)C)nc2F)n(C)c1=O
: