Target
Genome polyprotein [1657-3011]
Ligand
BDBM243440
Substrate
Meas. Tech.
Transient Transfection Assay
EC50
0.181±n/a nM
Citation
 Vandyck, KLast, SJHoupis, INRaboisson, PJ Benzimidazole-imidazole derivatives US Patent  US9433609 Publication Date 9/6/2016 
Target
Name:
Genome polyprotein [1657-3011]
Synonyms:
POLG_HCV77 | Serine protease NS3/RNA-directed RNA polymerase NS5B (NS3-NS5B)
Type:
Enzyme
Mol. Mass.:
147612.63
Organism:
Hepatitis C virus genotype 1a (isolate H77) (HCV)
Description:
aa 1657-3011
Residue:
1355
  
Inhibitor
Name:
BDBM243440
Synonyms:
US9427428, 6 | US9433609, 6
Type:
Small organic molecule
Emp. Form.:
C40H46N8O8
Mol. Mass.:
766.842
SMILES:
COC(=O)N[C@@H]([C@@H](C)O)C(=O)N1CCC[C@H]1c1ncc([nH]1)-c1ccc2cc(ccc2c1)-c1ccc2nc([nH]c2c1)[C@@H]1CCCN1C(=O)[C@@H](NC(=O)OC)[C@@H](C)O
: