Target
Genome polyprotein [1657-3011]
Ligand
BDBM243445
Substrate
Meas. Tech.
Transient Transfection Assay
EC50
0.989±n/a nM
Citation
 Vandyck, KLast, SJHoupis, INRaboisson, PJ Benzimidazole-imidazole derivatives US Patent  US9433609 Publication Date 9/6/2016 
Target
Name:
Genome polyprotein [1657-3011]
Synonyms:
POLG_HCV77 | Serine protease NS3/RNA-directed RNA polymerase NS5B (NS3-NS5B)
Type:
Enzyme
Mol. Mass.:
147612.63
Organism:
Hepatitis C virus genotype 1a (isolate H77) (HCV)
Description:
aa 1657-3011
Residue:
1355
  
Inhibitor
Name:
BDBM243445
Synonyms:
US9427428, 7 | US9433609, 7
Type:
Small organic molecule
Emp. Form.:
C44H54N8O6
Mol. Mass.:
790.9496
SMILES:
COC(=O)N[C@@H](CC(C)C)C(=O)N1CCC[C@H]1c1ncc([nH]1)-c1ccc2cc(ccc2c1)-c1ccc2nc([nH]c2c1)[C@@H]1CCCN1C(=O)[C@H](CC(C)C)NC(=O)OC
: