Target
Carbonic anhydrase 13
Ligand
BDBM246550
Substrate
Meas. Tech.
Thermal Shift Assay (TSA)
pH
7±n/a
Kd
23.2±n/a nM
Comments
extracted
Citation
 Zubriene, ACapkauskaite, EGylyte, JKi?onaite, MTumkevicius, SMatulis, D Benzenesulfonamides with benzimidazole moieties as inhibitors of carbonic anhydrases I, II, VII, XII and XIII. J Enzyme Inhib Med Chem 29:124-31 (2014)  
Target
Name:
Carbonic anhydrase 13
Synonyms:
CA13 Carbonic anhydrase Carbonic anhydrase XIII (CA XIII)
Type:
Enzyme
Mol. Mass.:
29445.78
Organism:
Homo sapiens (Human)
Description:
Q8N1Q1
Residue:
262
  
Inhibitor
Name:
BDBM246550
Synonyms:
2-Chloro-4-[(2-methyl-1H-benzimidazol-1-yl)acetyl]benzenesulfonamide (2b)
Type:
Small organic molecule
Emp. Form.:
C16H14ClN3O3S
Mol. Mass.:
363.819
SMILES:
Cc1nc2ccccc2n1CC(=O)c1ccc(c(Cl)c1)S(N)(=O)=O
: