Target
Histamine receptor H3
Ligand
BDBM247469
Substrate
Meas. Tech.
Radioligand Binding Assay
Ki
33.7±n/a nM
Citation
 Gao, Z Substituted phenyl cycloalkyl pyrrolidine (piperidine) spirolactams and amides, preparation and therapeutic use thereof US Patent  US9453023 Publication Date 9/27/2016 
Target
Name:
Histamine receptor H3
Synonyms:
Type:
Enzyme
Mol. Mass.:
48611.84
Organism:
Macaca mulatta (Rhesus macaque)
Description:
Q865E1
Residue:
445
  
Inhibitor
Name:
BDBM247469
Synonyms:
US9453023, 28
Type:
Small organic molecule
Emp. Form.:
C22H32N2O2
Mol. Mass.:
356.5017
SMILES:
C[C@H]1CCCN1C1CC[C@@H](C1)c1ccc(NC(=O)C2CCOCC2)cc1
: