Target
Inosine-5'-monophosphate dehydrogenase 2
Ligand
BDBM248130
Substrate
Meas. Tech.
Enzyme Assay
pH
8±0
Temperature
310.15±0 K
IC50
<3e+4±0 nM
Citation
 Dunkern, TChavan, SBankar, DPatil, AKulkarni, PKharkar, PSPrabhu, AGoebel, HRolser, EBurckhard-Boer, WArumugam, PMakhija, MT Design, synthesis and biological evaluation of novel inosine 5'-monophosphate dehydrogenase (IMPDH) inhibitors. J Enzyme Inhib Med Chem 29:408-19 (2014)  
Target
Name:
Inosine-5'-monophosphate dehydrogenase 2
Synonyms:
IMDH2_HUMAN IMPD 2 IMPDH-II Inosine 5'-monophosphate dehydrogenase II (IMPDH II) Inosine-5 -monophosphate dehydrogenase 2 | Inosine-5'-monophosphate dehydrogenase (IMPDH)
Type:
Enzyme
Mol. Mass.:
55806.87
Organism:
Homo sapiens (Human)
Description:
Recombinant IMPDH2 expressed in E. coli.
Residue:
514
  
Inhibitor
Name:
BDBM248130
Synonyms:
IMPDH II inhibitor, 49
Type:
Small organic molecule
Emp. Form.:
C19H17N9O
Mol. Mass.:
387.398
SMILES:
COc1cc(N\C(Nc2cccc(Cc3nnn(C)n3)c2)=N\C#N)ccc1C#N
: