Target
Tyrosine-protein kinase ZAP-70
Ligand
BDBM6619
Substrate
N-biotinyl peptide substrate
Meas. Tech.
Tyrosine Kinase Assay
pH
7±n/a
Temperature
295.15±n/a K
IC50
>10000±n/a nM
Citation
 Honma, TYoshizumi, THashimoto, NHayashi, KKawanishi, NFukasawa, KTakaki, TIkeura, CIkuta, MSuzuki-Takahashi, IHayama, TNishimura, SMorishima, H A novel approach for the development of selective Cdk4 inhibitors: library design based on locations of Cdk4 specific amino acid residues. J Med Chem 44:4628-40 (2001)  
Target
Name:
Tyrosine-protein kinase ZAP-70
Synonyms:
70 kDa zeta-associated protein Syk-related tyrosine kinase Tyrosine-protein kinase ZAP-70 Tyrosine-protein kinase ZAP-70 (ZAP70) ZAP70 Zeta-chain (TCR) associated protein kinase 70kDa
Type:
Enzyme
Mol. Mass.:
69881.61
Organism:
Homo sapiens (Human)
Description:
ZAP-70 SH2 domain was expressed and purified from E. coli using O-phospho-L-tyrosine-agarose column.
Residue:
619
  
Inhibitor
Name:
BDBM6619
Synonyms:
3-[(9bR)-5-oxo-1H,2H,3H,5H,9bH-benzo[a]pyrrolizin-9-yl]-1-pyridin-2-ylurea N -(pyrrolidino[2,1-b]isoindolin-4-on-8-yl)-N-(pyridin-2yl)urea diarylurea deriv. 1
Type:
Small organic molecule
Emp. Form.:
C17H16N4O2
Mol. Mass.:
308.3345
SMILES:
O=C(Nc1ccccn1)Nc1cccc2C(=O)N3CCC[C@@H]3c12
:
Substrate
Name:
N-biotinyl peptide substrate
Synonyms:
Type:
Peptide
Mol. Mass.:
3583.82
Organism:
Description:
Residue:
31