Target
Carbonate dehydratase
Ligand
BDBM10880
Substrate
Meas. Tech.
ChEMBL_158310 (CHEMBL763367)
pH
7.5±0
Temperature
293.15±0 K
Ki
40±0 nM
Km
14700000±0 nM
Citation
 Del Prete, SVullo, DDe Luca, VCarginale, Vdi Fonzo, POsman, SMAlOthman, ZSupuran, CTCapasso, C Anion inhibition profiles of a-, ß- and ¿-carbonic anhydrases from the pathogenic bacterium Vibrio cholerae. Bioorg Med Chem 24:3413-7 (2016)  
Target
Name:
Carbonate dehydratase
Synonyms:
Beta-carbonic anhydrase | PgiCAb
Type:
Protein
Mol. Mass.:
26160.23
Organism:
Porphyromonas gingivalis JCVI SC001
Description:
T2NA71
Residue:
242
  
Inhibitor
Name:
BDBM10880
Synonyms:
AZA AZM acetazolamide Acetazolamide Acetazolamide (AZA) Acetazolamide, 5 Acetazolamide, AZA CHEMBL20 Sulfonamide, 1 US11278534, Example acetazolamide sulfonamide 1
Type:
Small organic molecule
Emp. Form.:
C4H6N4O3S2
Mol. Mass.:
222.245
SMILES:
CC(=O)Nc1nnc(s1)S(N)(=O)=O
: