Target
Melanocyte-stimulating hormone receptor
Ligand
BDBM250653
Substrate
Meas. Tech.
Competitive Inhibition Binding Assay
pH
7.5±n/a
Temperature
310.15±n/a K
Ki
0.01±n/a nM
Comments
extracted
Citation
 Yang, WShi, Y Melanocortin-1 receptor-specific cyclic peptides US Patent  US9447148 Publication Date 9/20/2016 
Target
Name:
Melanocyte-stimulating hormone receptor
Synonyms:
MC1-R MSH-R MSHR_HUMAN Melanocortin receptor (M1 and M4) Melanocortin receptor 1 (MC1-R) | Melanocortin receptor 1 (MC1R)
Type:
Enzyme
Mol. Mass.:
34717.23
Organism:
Homo sapiens (Human)
Description:
Q01726
Residue:
317
  
Inhibitor
Name:
BDBM250653
Synonyms:
US9447148, 9.22
Type:
Small organic molecule
Emp. Form.:
C49H66N14O8
Mol. Mass.:
979.1373
SMILES:
NC(=N)NCCC[C@@H]1NC(=O)[C@@H](Cc2ccccc2)NC(=O)[C@H](Cc2c[nH]cn2)NC(=O)[C@H](CCC(=O)NCC[C@H](NC1=O)C(=O)N[C@@H](Cc1c[nH]c2ccccc12)C(N)=O)NC(=O)CC1CCCCC1
: