Target
Lysophosphatidic acid receptor 5
Ligand
BDBM251722
Substrate
Meas. Tech.
Receptor Assay
Temperature
310.15±n/a K
IC50
32±n/a nM
Comments
extracted
Citation
 Buffham, WCanning, HDavenport, RFarnaby, WMack, SParmar, AWright, S Compounds US Patent  US9464060 Publication Date 10/11/2016 
Target
Name:
Lysophosphatidic acid receptor 5
Synonyms:
GPR92 LPAR5 Lysophosphatidic acid receptor 5 | Lysophosphatidic acid receptor 5 (LPA5)
Type:
Enzyme
Mol. Mass.:
41372.36
Organism:
Homo sapiens (Human)
Description:
Q9H1C0
Residue:
372
  
Inhibitor
Name:
BDBM251722
Synonyms:
US9464060, 58
Type:
Small organic molecule
Emp. Form.:
C31H34FNO5
Mol. Mass.:
519.6038
SMILES:
COc1ccccc1O[C@H]1CC[C@@H](CC1)C(=O)N(CCCc1cccc(F)c1)Cc1ccc(cc1)C(O)=O
: