Target
Metabotropic glutamate receptor 2
Ligand
BDBM252761
Substrate
Meas. Tech.
[35S]GTPgammaS Binding Assay
Temperature
298.15±n/a K
IC50
44.6±n/a nM
Comments
extracted
Citation
 Takaishi, MSato, NShibuguchi, TMotoki, TTakahashi, YSasaki, TBraunton, A Tetrahydroimidazo(1,5-D)[1,4]oxazepine derivative US Patent  US9458176 Publication Date 10/4/2016 
Target
Name:
Metabotropic glutamate receptor 2
Synonyms:
GPRC1B GRM2_HUMAN Metabotropic glutamate receptor mGlu2 | metabotropic glutamate 2
Type:
Enzyme
Mol. Mass.:
95584.88
Organism:
Homo sapiens (Human)
Description:
Q14416
Residue:
872
  
Inhibitor
Name:
BDBM252761
Synonyms:
US9458176, 158
Type:
Small organic molecule
Emp. Form.:
C21H19F4N3O2
Mol. Mass.:
421.3881
SMILES:
C[C@@H]1Cn2c(CCO1)c(nc2-c1ccc(F)c(OC(F)(F)F)c1)-c1ccnc(C)c1
: