Target
Metabotropic glutamate receptor 2
Ligand
BDBM252838
Substrate
Meas. Tech.
[35S]GTPgammaS Binding Assay
Temperature
298.15±n/a K
IC50
21.7±n/a nM
Comments
extracted
Citation
 Takaishi, MSato, NShibuguchi, TMotoki, TTakahashi, YSasaki, TBraunton, A Tetrahydroimidazo(1,5-D)[1,4]oxazepine derivative US Patent  US9458176 Publication Date 10/4/2016 
Target
Name:
Metabotropic glutamate receptor 2
Synonyms:
GPRC1B GRM2_HUMAN Metabotropic glutamate receptor mGlu2 | metabotropic glutamate 2
Type:
Enzyme
Mol. Mass.:
95584.88
Organism:
Homo sapiens (Human)
Description:
Q14416
Residue:
872
  
Inhibitor
Name:
BDBM252838
Synonyms:
US9458176, 235
Type:
Small organic molecule
Emp. Form.:
C23H25F2N3O3
Mol. Mass.:
429.4597
SMILES:
C[C@@H]1Cn2c(CCO1)c(nc2-c1ccc(OC(F)F)c(CO)c1)-c1cc(C)nc(C)c1
: