Target
Prothrombin
Ligand
BDBM162662
Substrate
Meas. Tech.
Thrombin Activity Assay
pH
7.4±n/a
Temperature
298.15±n/a K
IC50
<100±n/a nM
Comments
extracted
Citation
 Short, KMPham, SMWilliams, DCKita, DB Multisubstituted aromatic compounds as serine protease inhibitors US Patent  US9687479 Publication Date 6/27/2017 
Target
Name:
Prothrombin
Synonyms:
Activation peptide fragment 1 Coagulation factor II Prothrombin precursor Thrombin heavy chain | Thrombin light chain
Type:
Protein
Mol. Mass.:
70029.57
Organism:
Homo sapiens (Human)
Description:
P00734
Residue:
622
  
Inhibitor
Name:
BDBM162662
Synonyms:
US9687479, 142 3-(5-[(5-chlorothiophen-2-yl)methyl]amino-1-[(2-methoxyphenyl)carbonyl]-1H-pyrazol-3-yl)-1-(pyrimidin-2-ylmethyl)-1,2-dihydropyridin-2-one
Type:
Small Organic Molecule
Emp. Form.:
C26H21ClN6O3S
Mol. Mass.:
533.001
SMILES:
COc1ccccc1C(=O)n1nc(cc1NCc1ccc(Cl)s1)-c1cccn(Cc2ncccn2)c1=O
: