Target
Plasma kallikrein
Ligand
BDBM163596
Substrate
Meas. Tech.
KLKB1 Activity Assay
pH
7.4±n/a
Temperature
298.15±n/a K
IC50
5500±n/a nM
Comments
extracted
Citation
 Short, KMPham, SMWilliams, DCKita, DB Multisubstituted aromatic compounds as serine protease inhibitors US Patent  US9687479 Publication Date 6/27/2017 
Target
Name:
Plasma kallikrein
Synonyms:
Fletcher factor KLKB1 Kallikrein Plasma kallikrein heavy chain Plasma prekallikrein
Type:
Protein
Mol. Mass.:
71391.16
Organism:
Homo sapiens (Human)
Description:
P03952
Residue:
638
  
Inhibitor
Name:
BDBM163596
Synonyms:
US9687479, 361 1-benzoyl-N-[(4-methoxyphenyl)methyl]-3-(pyridin-3-yl)-1H-1,2,4-triazol-5-amine
Type:
Small Organic Molecule
Emp. Form.:
C22H19N5O2
Mol. Mass.:
385.4186
SMILES:
COc1ccc(CNc2nc(nn2C(=O)c2ccccc2)-c2cccnc2)cc1
: