Target
Complement factor D
Ligand
BDBM254461
Substrate
Meas. Tech.
Human Complement Factor D Assay
pH
7.5±n/a
Temperature
298.15±n/a K
IC50
27±n/a nM
Comments
extracted
Citation
 Altmann, EHommel, ULorthiois, ELMaibaum, JKOstermann, NQuancard, JRandl, SARogel, OVulpetti, A Pyrrolidine derivatives and their use as complement pathway modulators US Patent  US9468661 Publication Date 10/18/2016 
Target
Name:
Complement factor D
Synonyms:
Adipsin CFAD_HUMAN DF Properdin factor D
Type:
Protein
Mol. Mass.:
27039.19
Organism:
Homo sapiens (Human)
Description:
P00746
Residue:
253
  
Inhibitor
Name:
BDBM254461
Synonyms:
US9468661, 39
Type:
Small organic molecule
Emp. Form.:
C22H26Cl2N6O3
Mol. Mass.:
493.386
SMILES:
CCc1cc2c(nn(CC(=O)N3[C@@H]4C[C@@H]4C[C@H]3C(=O)N[C@H](C)[C@H]3CC3(Cl)Cl)c2cn1)C(N)=O
: