Target
Complement factor D
Ligand
BDBM254470
Substrate
Meas. Tech.
Human Complement Factor D Assay
pH
7.5±n/a
Temperature
298.15±n/a K
IC50
27±n/a nM
Comments
extracted
Citation
 Altmann, EHommel, ULorthiois, ELMaibaum, JKOstermann, NQuancard, JRandl, SARogel, OVulpetti, A Pyrrolidine derivatives and their use as complement pathway modulators US Patent  US9468661 Publication Date 10/18/2016 
Target
Name:
Complement factor D
Synonyms:
Adipsin CFAD_HUMAN DF Properdin factor D
Type:
Protein
Mol. Mass.:
27039.19
Organism:
Homo sapiens (Human)
Description:
P00746
Residue:
253
  
Inhibitor
Name:
BDBM254470
Synonyms:
US9468661, 48
Type:
Small organic molecule
Emp. Form.:
C21H24Cl2FN5O4
Mol. Mass.:
500.351
SMILES:
CO[C@@H]1[C@@H](F)CN([C@@H]1C(=O)NC[C@H]1CC1(Cl)Cl)C(=O)Cn1nc(C(N)=O)c2ccc(C)cc12
: