Target
Complement factor D
Ligand
BDBM254487
Substrate
Meas. Tech.
Human Complement Factor D Assay
pH
7.5±n/a
Temperature
298.15±n/a K
IC50
20±n/a nM
Comments
extracted
Citation
 Altmann, EHommel, ULorthiois, ELMaibaum, JKOstermann, NQuancard, JRandl, SARogel, OVulpetti, A Pyrrolidine derivatives and their use as complement pathway modulators US Patent  US9468661 Publication Date 10/18/2016 
Target
Name:
Complement factor D
Synonyms:
Adipsin CFAD_HUMAN DF Properdin factor D
Type:
Protein
Mol. Mass.:
27039.19
Organism:
Homo sapiens (Human)
Description:
P00746
Residue:
253
  
Inhibitor
Name:
BDBM254487
Synonyms:
US9468661, 65
Type:
Small organic molecule
Emp. Form.:
C28H32N6O4
Mol. Mass.:
516.5915
SMILES:
CC1CC(CNC(=O)[C@@H]2C[C@H]3C[C@H]3N2C(=O)Cn2nc(C(C)=O)c3cc(OCc4ncccn4)ccc23)C1
: