Target
Complement factor D
Ligand
BDBM254526
Substrate
Meas. Tech.
Human Complement Factor D Assay
pH
7.5±n/a
Temperature
298.15±n/a K
IC50
16±n/a nM
Comments
extracted
Citation
 Altmann, EHommel, ULorthiois, ELMaibaum, JKOstermann, NQuancard, JRandl, SARogel, OVulpetti, A Pyrrolidine derivatives and their use as complement pathway modulators US Patent  US9468661 Publication Date 10/18/2016 
Target
Name:
Complement factor D
Synonyms:
Adipsin CFAD_HUMAN DF Properdin factor D
Type:
Protein
Mol. Mass.:
27039.19
Organism:
Homo sapiens (Human)
Description:
P00746
Residue:
253
  
Inhibitor
Name:
BDBM254526
Synonyms:
US9468661, 104
Type:
Small organic molecule
Emp. Form.:
C28H30Cl2N6O4
Mol. Mass.:
585.482
SMILES:
CC(=O)c1nn(CC(=O)N2[C@@H]3C[C@@H]3C[C@H]2C(=O)NC[C@H]2C(C)(C)C2(Cl)Cl)c2ccc(OCc3ncccn3)cc12
: