Target
Complement factor D
Ligand
BDBM254529
Substrate
Meas. Tech.
Human Complement Factor D Assay
pH
7.5±n/a
Temperature
298.15±n/a K
IC50
52±n/a nM
Comments
extracted
Citation
 Altmann, EHommel, ULorthiois, ELMaibaum, JKOstermann, NQuancard, JRandl, SARogel, OVulpetti, A Pyrrolidine derivatives and their use as complement pathway modulators US Patent  US9468661 Publication Date 10/18/2016 
Target
Name:
Complement factor D
Synonyms:
Adipsin CFAD_HUMAN DF Properdin factor D
Type:
Protein
Mol. Mass.:
27039.19
Organism:
Homo sapiens (Human)
Description:
P00746
Residue:
253
  
Inhibitor
Name:
BDBM254529
Synonyms:
US9468661, 107
Type:
Small organic molecule
Emp. Form.:
C22H25Cl2N5O3
Mol. Mass.:
478.372
SMILES:
CC1(C)[C@H](CNC(=O)[C@@H]2C[C@H]3C[C@H]3N2C(=O)Cn2nc(C(N)=O)c3ccccc23)C1(Cl)Cl
: