Target
Casein kinase I isoform delta
Ligand
BDBM255209
Substrate
Meas. Tech.
Kinase Assay
pH
7.4±n/a
Temperature
298.15±n/a K
IC50
1.3±n/a nM
Comments
extracted
Citation
 Velaparthi, UDarne, CPDodd, DSLiu, PMussari, CPWittman, MDKumaravel, SMullick, D Pyrazole substituted imidazopyrazines as casein kinase 1 d/e inhibitors US Patent  US9475817 Publication Date 10/25/2016 
Target
Name:
Casein kinase I isoform delta
Synonyms:
CKI-delta CSNK1D Casein kinase I delta Casein kinase I isoform delta (CK1D) KC1D_HUMAN | casein kinases 1 delta (CK1 delta)
Type:
Enzyme
Mol. Mass.:
47356.76
Organism:
Homo sapiens (Human)
Description:
P48730
Residue:
415
  
Inhibitor
Name:
BDBM255209
Synonyms:
US9475817, 168
Type:
Small organic molecule
Emp. Form.:
C29H29FN8O2
Mol. Mass.:
540.5914
SMILES:
Cn1nc(c(c1C1CCN(CCO)CC1)-c1ccc2nc(NC(=O)c3ccncc3)cn2n1)-c1ccc(F)cc1
: