Target
Orexin receptor type 2
Ligand
BDBM164137
Substrate
Meas. Tech.
Radioligand Binding Assay
Temperature
313.15±n/a K
Ki
1700±n/a nM
Comments
extracted
Citation
 Coate, HRDvorak, CALebold, TPPreville, CShireman, BT Substituted 7-azabicycles and their use as orexin receptor modulators US Patent  US9475819 Publication Date 10/25/2016 
Target
Name:
Orexin receptor type 2
Synonyms:
HCRTR2 OX2R_HUMAN Orexin receptor type 2 (OR-2) Orexin receptor type 2 (OX2R) Ox-2-R | Ox2-R
Type:
Protein
Mol. Mass.:
50710.53
Organism:
Homo sapiens (Human)
Description:
O43614
Residue:
444
  
Inhibitor
Name:
BDBM164137
Synonyms:
US9062078, 267 US9637496, 267 | US9695183, 267
Type:
Small organic molecule
Emp. Form.:
C22H18F4N6O
Mol. Mass.:
458.4115
SMILES:
Fc1ccc(C(=O)N2C3CCC2C(C3)Nc2cnc(cn2)C(F)(F)F)c(c1)-c1ncccn1
: