Target
Transient receptor potential cation channel subfamily M member 8
Ligand
BDBM256292
Substrate
Meas. Tech.
Inhibition Assay
Temperature
310.15±n/a K
IC50
1.6±n/a nM
Comments
extracted
Citation
 Kato, TSakamoto, TKubo, ASawamoto, D Sulfonamide compound US Patent  US9487488 Publication Date 11/8/2016 
Target
Name:
Transient receptor potential cation channel subfamily M member 8
Synonyms:
LTRPC6 TRPM8_HUMAN Transient receptor potential M8 protein (TRPM8) Transient receptor potential cation channel subfamily M member 8 (TRPM8)
Type:
Enzyme
Mol. Mass.:
127693.26
Organism:
Homo sapiens (Human)
Description:
Q7Z2W7
Residue:
1104
  
Inhibitor
Name:
BDBM256292
Synonyms:
US9487488, 16
Type:
Small organic molecule
Emp. Form.:
C24H15F6N7O3S
Mol. Mass.:
595.476
SMILES:
FC(F)(F)Oc1ccc(CN(c2ncc3ccccc3c2C(F)(F)F)S(=O)(=O)c2ccc(nc2)-c2nnn[nH]2)cc1
: