Target
Transient receptor potential cation channel subfamily M member 8
Ligand
BDBM256298
Substrate
Meas. Tech.
Inhibition Assay
Temperature
310.15±n/a K
IC50
0.6±n/a nM
Comments
extracted
Citation
 Kato, TSakamoto, TKubo, ASawamoto, D Sulfonamide compound US Patent  US9487488 Publication Date 11/8/2016 
Target
Name:
Transient receptor potential cation channel subfamily M member 8
Synonyms:
LTRPC6 TRPM8_HUMAN Transient receptor potential M8 protein (TRPM8) Transient receptor potential cation channel subfamily M member 8 (TRPM8)
Type:
Enzyme
Mol. Mass.:
127693.26
Organism:
Homo sapiens (Human)
Description:
Q7Z2W7
Residue:
1104
  
Inhibitor
Name:
BDBM256298
Synonyms:
US9487488, 22
Type:
Small organic molecule
Emp. Form.:
C29H24F3N5O3S
Mol. Mass.:
579.593
SMILES:
Cc1n[nH]c(n1)-c1ccc(cc1)S(=O)(=O)N(Cc1ccc(OC(F)(F)F)cc1)c1ncc2ccccc2c1C1CC1
: