Target
Transient receptor potential cation channel subfamily M member 8
Ligand
BDBM256302
Substrate
Meas. Tech.
Inhibition Assay
Temperature
310.15±n/a K
IC50
1.0±n/a nM
Comments
extracted
Citation
 Kato, TSakamoto, TKubo, ASawamoto, D Sulfonamide compound US Patent  US9487488 Publication Date 11/8/2016 
Target
Name:
Transient receptor potential cation channel subfamily M member 8
Synonyms:
LTRPC6 TRPM8_HUMAN Transient receptor potential M8 protein (TRPM8) Transient receptor potential cation channel subfamily M member 8 (TRPM8)
Type:
Enzyme
Mol. Mass.:
127693.26
Organism:
Homo sapiens (Human)
Description:
Q7Z2W7
Residue:
1104
  
Inhibitor
Name:
BDBM256302
Synonyms:
US9487488, 26
Type:
Small organic molecule
Emp. Form.:
C28H23F3N6O2S
Mol. Mass.:
564.581
SMILES:
Cc1cc(ccc1-c1ncn[nH]1)S(=O)(=O)N(Cc1ccc(cn1)C(F)(F)F)c1ncc2ccccc2c1C1CC1
: