Target
Amine oxidase [flavin-containing] B
Ligand
BDBM65039
Substrate
Meas. Tech.
Inhibitory Activity Assay
pH
7.5±n/a
Temperature
298.15±n/a K
IC50
>100000±n/a nM
Comments
extracted
Citation
 Matsumoto, SHattori, YToyofuku, MMorimoto, SDaini, MKojima, TKaku, TIto, M Cyclopropanamine compound and use thereof US Patent  US9487511 Publication Date 11/8/2016 
Target
Name:
Amine oxidase [flavin-containing] B
Synonyms:
AOFB_HUMAN MAOB Monoamine oxidase type B (MAO B) Monoamine oxidase type B (MAOB)
Type:
Protein
Mol. Mass.:
58768.76
Organism:
Homo sapiens (Human)
Description:
P27338
Residue:
520
  
Inhibitor
Name:
BDBM65039
Synonyms:
BDBM256703 US10414761, Example 85 US9487511, 116 US9920047, 85
Type:
Emp. Form.:
C15H18N4OS2
Mol. Mass.:
334.46
SMILES:
Cc1nnc(NC(=O)c2cc(cs2)[C@H]2C[C@@H]2NC2CCC2)s1
: