Target
Beta-secretase 1
Ligand
BDBM259037
Substrate
Meas. Tech.
BACE1 HTRF FRET Assay
pH
5±n/a
Temperature
303.15±n/a K
Ki
18.3±n/a nM
Comments
extracted
Citation
 Wu, WBurnett, DAStamford, AWCumming, JNBennett, CEGilbert, EJScott, JDYu, YPeng, X 5-substituted iminothiazines and their mono- and dioxides as BACE inhibitors, compositions, and their use US Patent  US9499502 Publication Date 11/22/2016 
Target
Name:
Beta-secretase 1
Synonyms:
ASP2 Aspartyl protease 2 BACE1 Beta-secretase (BACE) Beta-secretase 1 (BACE 1) Beta-secretase 1 (BACE1) Beta-site amyloid precursor protein cleaving enzyme 1 Memapsin-2 beta-Secretase (BACE-1) | beta-Secretase (BACE1)
Type:
Protein
Mol. Mass.:
55755.10
Organism:
Homo sapiens (Human)
Description:
P56817
Residue:
501
  
Inhibitor
Name:
BDBM259037
Synonyms:
US9499502, 9do-a
Type:
Small organic molecule
Emp. Form.:
C25H24F2N4O4S
Mol. Mass.:
514.544
SMILES:
COc1ccc(nc1)C(=O)Nc1ccc(F)c(c1)[C@]1(C)CS(=O)(=O)[C@](C)(C(=N)N1)c1ccccc1F
: