Target
Serine/threonine-protein kinase Nek2 [C22A]
Ligand
BDBM259815
Substrate
Meas. Tech.
Nek2 Inhibition Assay
pH
7.6±n/a
Temperature
298.15±n/a K
IC50
>10000±n/a nM
Comments
extracted
Citation
 Taunton, Jr., JWMaglathlin, RSerafimova, ICohen, MSMiller, RPaavilainen, VMcFarland, JKrishnan, S Kinase inhibitors US Patent  US9505766 Publication Date 11/29/2016 
Target
Name:
Serine/threonine-protein kinase Nek2 [C22A]
Synonyms:
NEK2 NEK2_HUMAN Serine/threonine-protein kinase Nek2 (C22A)
Type:
Enzyme
Mol. Mass.:
51714.87
Organism:
Homo sapiens (Human)
Description:
C22A P51955
Residue:
445
  
Inhibitor
Name:
BDBM259815
Synonyms:
US9505766, 15
Type:
Small organic molecule
Emp. Form.:
C11H8N4O
Mol. Mass.:
212.2074
SMILES:
NC(=O)C(=C\c1ccc2cn[nH]c2c1)\C#N
: