Target
Serine/threonine-protein kinase Nek2 [C22A]
Ligand
BDBM259819
Substrate
Meas. Tech.
Nek2 Inhibition Assay
pH
7.6±n/a
Temperature
298.15±n/a K
IC50
>10000±n/a nM
Comments
extracted
Citation
 Taunton, Jr., JWMaglathlin, RSerafimova, ICohen, MSMiller, RPaavilainen, VMcFarland, JKrishnan, S Kinase inhibitors US Patent  US9505766 Publication Date 11/29/2016 
Target
Name:
Serine/threonine-protein kinase Nek2 [C22A]
Synonyms:
NEK2 NEK2_HUMAN Serine/threonine-protein kinase Nek2 (C22A)
Type:
Enzyme
Mol. Mass.:
51714.87
Organism:
Homo sapiens (Human)
Description:
C22A P51955
Residue:
445
  
Inhibitor
Name:
BDBM259819
Synonyms:
US9505766, 20
Type:
Small organic molecule
Emp. Form.:
C15H11N5O2S
Mol. Mass.:
325.345
SMILES:
CS(=O)(=O)C(=C\c1ccc(cc1)-c1ncnc2[nH]cnc12)\C#N
: