Target
Hepatocyte growth factor receptor
Ligand
BDBM259936
Substrate
Meas. Tech.
Inhibition Assay
Temperature
293.15±n/a K
IC50
12.1±n/a nM
Comments
extracted
Citation
 Zhao, ZWang, HWu, CQi, Q [1,2,4] triazol [4,3-A] pyridine derivative, preparation method therefor or medical application thereof US Patent  US9512121 Publication Date 12/6/2016 
Target
Name:
Hepatocyte growth factor receptor
Synonyms:
Hepatocyte growth factor receptor Hepatocyte growth factor receptor (c-MET) MET Met proto-oncogene (hepatocyte growth factor receptor) Tyrosine-protein kinase Met (c-Met) c-Met kinase
Type:
Protein
Mol. Mass.:
155559.73
Organism:
Homo sapiens (Human)
Description:
P08581
Residue:
1390
  
Inhibitor
Name:
BDBM259936
Synonyms:
US9512121, 14
Type:
Small organic molecule
Emp. Form.:
C22H17FN6O2S
Mol. Mass.:
448.473
SMILES:
Cn1cc(cn1)-c1cc(F)c2nnc(Sc3ccc4ncc5OCCCOc5c4c3)n2c1
: