Target
Hepatocyte growth factor receptor
Ligand
BDBM259938
Substrate
Meas. Tech.
Inhibition Assay
Temperature
293.15±n/a K
IC50
8.5±n/a nM
Comments
extracted
Citation
 Zhao, ZWang, HWu, CQi, Q [1,2,4] triazol [4,3-A] pyridine derivative, preparation method therefor or medical application thereof US Patent  US9512121 Publication Date 12/6/2016 
Target
Name:
Hepatocyte growth factor receptor
Synonyms:
Hepatocyte growth factor receptor Hepatocyte growth factor receptor (c-MET) MET Met proto-oncogene (hepatocyte growth factor receptor) Tyrosine-protein kinase Met (c-Met) c-Met kinase
Type:
Protein
Mol. Mass.:
155559.73
Organism:
Homo sapiens (Human)
Description:
P08581
Residue:
1390
  
Inhibitor
Name:
BDBM259938
Synonyms:
US9512121, 17
Type:
Small organic molecule
Emp. Form.:
C27H27N7O2S
Mol. Mass.:
513.614
SMILES:
Cn1cc(cn1)-c1ccc2nnc(Sc3ccc4ncc(N5CCOCC5)c(OCC5CC5)c4c3)n2c1
: