Target
Hepatocyte growth factor receptor
Ligand
BDBM259947
Substrate
Meas. Tech.
Inhibition Assay
Temperature
293.15±n/a K
IC50
12.1±n/a nM
Comments
extracted
Citation
 Zhao, ZWang, HWu, CQi, Q [1,2,4] triazol [4,3-A] pyridine derivative, preparation method therefor or medical application thereof US Patent  US9512121 Publication Date 12/6/2016 
Target
Name:
Hepatocyte growth factor receptor
Synonyms:
Hepatocyte growth factor receptor Hepatocyte growth factor receptor (c-MET) MET Met proto-oncogene (hepatocyte growth factor receptor) Tyrosine-protein kinase Met (c-Met) c-Met kinase
Type:
Protein
Mol. Mass.:
155559.73
Organism:
Homo sapiens (Human)
Description:
P08581
Residue:
1390
  
Inhibitor
Name:
BDBM259947
Synonyms:
US9512121, 31
Type:
Small organic molecule
Emp. Form.:
C21H16N6O2S
Mol. Mass.:
416.456
SMILES:
Cn1cc(cn1)-c1ccc2nnc(Sc3ccc4ncc5OCCOc5c4c3)n2c1
: