Target
Cannabinoid receptor 2
Ligand
BDBM259989
Substrate
Meas. Tech.
cAMP Assay
Temperature
310.15±n/a K
EC50
0.4±n/a nM
Comments
extracted
Citation
 Grether, UKimbara, AMatthias, NFabienne, RStephan, RRogers-Evans, MSchulz-Gasch, T Pyrazole compounds as CB2 agonists US Patent  US9512132 Publication Date 12/6/2016 
Target
Name:
Cannabinoid receptor 2
Synonyms:
CANNABINOID CB2 CB2 CB2B CNR2_HUMAN Cannabinoid CB2 receptor Cannabinoid receptor 2 (CB2R) | hCB2
Type:
G Protein-Coupled Receptor (GPCR)
Mol. Mass.:
39690.94
Organism:
Homo sapiens (Human)
Description:
P34972
Residue:
360
  
Inhibitor
Name:
BDBM259989
Synonyms:
US9512132, 25
Type:
Small organic molecule
Emp. Form.:
C17H23N7O2
Mol. Mass.:
357.4102
SMILES:
Cc1nonc1Cn1ncc2c(nc(nc12)C(C)(C)C)N1CC[C@H](O)C1
: