Target
Histamine H3 receptor
Ligand
BDBM294373
Substrate
Meas. Tech.
Binding Assay
pH
7.4±n/a
Temperature
300.15±n/a K
IC50
>100000000±n/a nM
Comments
extracted
Citation
 Ho, PSYoon, DOHan, SYLee, WIKim, JSPark, WSAhn, SOKim, HJ Substituted tricyclic heterocycles as histamine 4 receptor inhibitors US Patent  US9586959 Publication Date 3/7/2017 
Target
Name:
Histamine H3 receptor
Synonyms:
G-protein coupled receptor 97 HH3R HRH3 Histamine H3 receptor (H3) Histamine receptor (H3 and H4)
Type:
G Protein-Coupled Receptor (GPCR)
Mol. Mass.:
48691.47
Organism:
Homo sapiens (Human)
Description:
Binding assays were using CHO cells stably expressing hH3R receptors.
Residue:
445
  
Inhibitor
Name:
BDBM294373
Synonyms:
US9586959, Compound 104 US9586959, Compound 68
Type:
Small organic molecule
Emp. Form.:
C12H12BrN7
Mol. Mass.:
334.175
SMILES:
CNC1CN(C1)c1nc2ncc(Br)cc2n2cnnc12
: