Target
Orexin/Hypocretin receptor type 1
Ligand
BDBM118380
Substrate
Meas. Tech.
Receptor Radioligand Binding Assay
Temperature
298.15±n/a K
Ki
250±n/a nM
Comments
extracted
Citation
 Letavic, MARudolph, DASavall, BMShireman, BTSwanson, D Disubstituted octahydropyrrolo [3,4-C] pyrroles as orexin receptor modulators US Patent  US9586962 Publication Date 3/7/2017 
Target
Name:
Orexin/Hypocretin receptor type 1
Synonyms:
HCRTR1 OX1R_HUMAN Orexin receptor type 1 (OR 1) Orexin receptor type 1 (OX1) Orexin receptor type 1 (OxR1) | Ox1r
Type:
Protein
Mol. Mass.:
47554.50
Organism:
Homo sapiens (Human)
Description:
O43613
Residue:
425
  
Inhibitor
Name:
BDBM118380
Synonyms:
US11059828, Example 33 US8653263, 33 USRE48841, Example 33
Type:
Small organic molecule
Emp. Form.:
C26H23N3OS
Mol. Mass.:
425.545
SMILES:
O=C(N1CC2CN(CC2C1)c1ccc2ccccc2n1)c1ccccc1-c1cccs1
: