Target
Transthyretin
Ligand
BDBM50197883
Substrate
Meas. Tech.
In vitro evaluation of inhibitory activity against WT-TTR
IC50
3100±150 nM
Citation
 Vieira Simões, CJLourenço de Almeida, ZCVasconcelos Dias de Pinho e Melo, TMPontes Meireles Ferreira de Brito, RMSilva Costa, DCCabral Cardoso Lopes, AL Bis-furan derivatives as transthyretin (TTR) stabilizers and amyloid inhibitors for the treatment of familial amyloid polyneuropathy (FAP) US Patent  US10377729 Publication Date 8/13/2019 
Target
Name:
Transthyretin
Synonyms:
ATTR Prealbumin TTHY_HUMAN Transthyretin (TTR)
Type:
Enzyme
Mol. Mass.:
15884.31
Organism:
Homo sapiens (Human)
Description:
P02766
Residue:
147
  
Inhibitor
Name:
BDBM50197883
Synonyms:
CHEBI:78538 Tafamidis Vyndaqel
Type:
Small organic molecule
Emp. Form.:
C14H7Cl2NO3
Mol. Mass.:
308.116
SMILES:
OC(=O)c1ccc2nc(oc2c1)-c1cc(Cl)cc(Cl)c1
: