Target
Epoxide hydrolase
Ligand
BDBM158487
Substrate
Meas. Tech.
Inhibition Assay
IC50
1.000±n/a nM
Citation
 Guedes, AGHammock, BDMorisseau, C Treatment of inflammatory disorders in non-human mammals US Patent  US10383835 Publication Date 8/20/2019 
Target
Name:
Epoxide hydrolase
Synonyms:
EPHX1
Type:
Enzyme
Mol. Mass.:
52112.47
Organism:
Ovis aries (Sheep)
Description:
W5Q7Q6
Residue:
451
  
Inhibitor
Name:
BDBM158487
Synonyms:
US10383835, Compound 2226 | US9029401, 2253
Type:
Small organic molecule
Emp. Form.:
C22H23ClF3N3O3
Mol. Mass.:
469.885
SMILES:
CNC(=O)c1ccc(O[C@H]2CCC(CC2)NC(=O)Nc2ccc(Cl)c(c2)C(F)(F)F)cc1
: