Target
Tyrosine-protein kinase JAK1
Ligand
BDBM411424
Substrate
Meas. Tech.
Enzyme Assay
IC50
0.590±n/a nM
Citation
 Watanabe, TTakahashi, KHayashi, KNakamura, TMinami, MKurihara, KYamamoto, ANishimura, TUni, MKamiyama, TIwamoto, S Tricyclic compound and JAK inhibitor US Patent  US10385052 Publication Date 8/20/2019 
Target
Name:
Tyrosine-protein kinase JAK1
Synonyms:
JAK-1 JAK1A JAK1_HUMAN Janus kinase 1 (JAK1) | Janus kinase 1 JAK1
Type:
Protein
Mol. Mass.:
133293.73
Organism:
Homo sapiens (Human)
Description:
P23458
Residue:
1154
  
Inhibitor
Name:
BDBM411424
Synonyms:
US10385052, Example 5
Type:
Small organic molecule
Emp. Form.:
C19H22F3N3O2
Mol. Mass.:
381.3921
SMILES:
FC(F)(F)COCC1CCC(CC1)N1C=CC(=O)C2C=Nc3[nH]ccc3C12
: