Target
Integrase
Ligand
BDBM294749
Substrate
Meas. Tech.
Anti-HIV Activity MT4 Assay
IC50
13.0±n/a nM
Citation
 Johns, BAVelthuisen, EJWeatherhead, JGSuwandi, LTemelkoff, D Isoindoline derivatives for use in the treatment of a viral infection US Patent  US10112899 Publication Date 10/30/2018 
Target
Name:
Integrase
Synonyms:
Human immunodeficiency virus type 1 integrase
Type:
PROTEIN
Mol. Mass.:
32231.48
Organism:
Human immunodeficiency virus 1
Description:
ChEMBL_90865
Residue:
288
  
Inhibitor
Name:
BDBM294749
Synonyms:
US10112899, Example 223
Type:
Small organic molecule
Emp. Form.:
C28H33N3O4
Mol. Mass.:
475.5793
SMILES:
Cc1ccc(cc1)-c1c(C)c2CN(Cc2c(C)c1[C@H](OC(C)(C)C)C(O)=O)C(=O)c1ccnn1C
: