Target
Lysine-specific histone demethylase 1A
Ligand
BDBM65039
Substrate
Meas. Tech.
Inhibition Activity Assay
IC50
810±n/a nM
Citation
 Matsumoto, SHattori, YToyofuku, MMorimoto, SDaini, MKojima, TKaku, TIto, M Cyclopropanamine compound and use thereof US Patent  US10414761 Publication Date 9/17/2019 
Target
Name:
Lysine-specific histone demethylase 1A
Synonyms:
AOF2 Flavin-containing amine oxidase domain-containing protein 2 KDM1A KIAA0601 Lysine-specific demethylase 1 (LSD1) Lysine-specific histone demethylase 1 (LSD1)
Type:
Enzyme
Mol. Mass.:
92901.01
Organism:
Homo sapiens (Human)
Description:
O60341
Residue:
852
  
Inhibitor
Name:
BDBM65039
Synonyms:
BDBM256703 US10414761, Example 85 US9487511, 116 US9920047, 85
Type:
Emp. Form.:
C15H18N4OS2
Mol. Mass.:
334.46
SMILES:
Cc1nnc(NC(=O)c2cc(cs2)[C@H]2C[C@@H]2NC2CCC2)s1
: