Target
Amine oxidase [flavin-containing] A
Ligand
BDBM65039
Substrate
Meas. Tech.
Inhibition Activity Assay
IC50
>100000±n/a nM
Citation
 Matsumoto, SHattori, YToyofuku, MMorimoto, SDaini, MKojima, TKaku, TIto, M Cyclopropanamine compound and use thereof US Patent  US10414761 Publication Date 9/17/2019 
Target
Name:
Amine oxidase [flavin-containing] A
Synonyms:
AOFA_HUMAN MAO-A Monoamine oxidase Monoamine oxidase type A (MAO A) Monoamine oxidase type A (MAOA)
Type:
Protein
Mol. Mass.:
59689.53
Organism:
Homo sapiens (Human)
Description:
P21397
Residue:
527
  
Inhibitor
Name:
BDBM65039
Synonyms:
BDBM256703 US10414761, Example 85 US9487511, 116 US9920047, 85
Type:
Emp. Form.:
C15H18N4OS2
Mol. Mass.:
334.46
SMILES:
Cc1nnc(NC(=O)c2cc(cs2)[C@H]2C[C@@H]2NC2CCC2)s1
: