Target
Isocitrate dehydrogenase [NADP] cytoplasmic [R132H]
Ligand
BDBM247710
Substrate
Meas. Tech.
Mutant IDH1 Biochemical Assay: LC-MS Detection of 2-HG
pH
7.4±n/a
Temperature
298.15±n/a K
IC50
144±n/a nM
Comments
extracted
Citation
 Caferro, TRChen, ZCho, YSCostales, AQLevell, JRLiu, GManning, JRSendzik, MShafer, CShultz, MDSutton, JCWang, YZhao, Q 3-pyrimidin-4-yl-oxazolidin-2-ones as inhibitors of mutant IDH US Patent  US10112931 Publication Date 10/30/2018 
Target
Name:
Isocitrate dehydrogenase [NADP] cytoplasmic [R132H]
Synonyms:
Cytosolic NADP-isocitrate dehydrogenase (IDH1)(R132H) IDH1 R132H IDHC_HUMAN Isocitrate dehydrogenase 1 mutant (R132H) Isocitrate dehydrogenase [NADP] cytoplasmic (IDH1)(R132H) PICD
Type:
Protein
Mol. Mass.:
46641.74
Organism:
Homo sapiens (Human)
Description:
Human IDH1 R132H (SEQ ID No. 2 in patent). First three are removed. Google patent parsed wrong.
Residue:
414
  
Inhibitor
Name:
BDBM247710
Synonyms:
US10112931, Example 312 US9688672, Example 312
Type:
Small organic molecule
Emp. Form.:
C17H18Cl2N4O3
Mol. Mass.:
397.256
SMILES:
C[C@@H](O)[C@H]1COC(=O)N1c1ccnc(N[C@@H](C)c2ccc(Cl)c(Cl)c2)n1
: