Target
Ubiquitin carboxyl-terminal hydrolase 1
Ligand
BDBM324907
Substrate
Meas. Tech.
Ubitquin-Rhodamine 110 Assay for USP1 Activity
IC50
<50±n/a nM
Citation
 Buckmelter, AJIoannidis, SFollows, BGustafson, GWang, MCaravella, JAWang, ZFritzen, ELLin, J Purinones as ubiquitin-specific protease 1 inhibitors US Patent  US10399980 Publication Date 9/3/2019 
Target
Name:
Ubiquitin carboxyl-terminal hydrolase 1
Synonyms:
Deubiquitinating enzyme 1 USP1 Ubiquitin thioesterase 1 hUBP
Type:
PROTEIN
Mol. Mass.:
88191.62
Organism:
Homo sapiens (Human)
Description:
ChEMBL_104169
Residue:
785
  
Inhibitor
Name:
BDBM324907
Synonyms:
2-(2-isopropylpyridin-3- US10399980, Compound I-113 | US11161848, Compound I-113
Type:
Small organic molecule
Emp. Form.:
C26H24F3N7O
Mol. Mass.:
507.5103
SMILES:
CC(C)c1ncccc1-c1ncc2n(C)c(=O)n(Cc3ccc(cc3)-n3nc(cc3C)C(F)(F)F)c2n1
: