Target
Disintegrin and metalloproteinase domain-containing protein 17
Ligand
BDBM419182
Substrate
Meas. Tech.
Cell-based Screening of Chemical Libraries for Characterization of Necroptosis Inhibitors
EC50
3500±n/a nM
Citation
 Dimanche-Boitrel, MBach, SDelehouze, CGoekjian, PComte, A Substituted pyrrolo[2,3-b]pyridines as inhibitors of cellular necroptosis US Patent  US10457678 Publication Date 10/29/2019 
Target
Name:
Disintegrin and metalloproteinase domain-containing protein 17
Synonyms:
ADA17_HUMAN CSVP Disintegrin and metalloproteinase domain-containing protein 17 (ADAM17) TNF-alpha convertase TNF-alpha-converting enzyme (TACE) Tumor necrosis factor-α converting enzyme (TACE)
Type:
Enzyme
Mol. Mass.:
93007.89
Organism:
Homo sapiens (Human)
Description:
Residue:
824
  
Inhibitor
Name:
BDBM419182
Synonyms:
US10457678, Compound 35
Type:
Small organic molecule
Emp. Form.:
C20H21N3O2
Mol. Mass.:
335.3996
SMILES:
CCOc1ccc(cc1)-c1cc2cccn(C(=O)N3CCCC3)c2n1
: